���_ID,��s����,����,���ݒn,�ܓx�P,�o�x�P,�ܓx�Q,�o�x�Q,�ܓx�R,�o�x�R,�ܓx�S,�o�x�S,�ܓx�T,�o�x�T,�ܓx�U,�o�x�U,�A����,�A����ڍ�,���o�ɉ\����,�x�Ɠ�,���e�䐔,�ꎞ���p/������p�̕�,�ꎞ���p�����̗L��/�����̕�,������p�����̗L��/�����̕�,�W�������P,�W�������Q,���l,���񋟌�,
1001,���c��,�H�t���w������P���]�Ԓ��ԏ�,�����s���c��_�c���͒�4��,35.697952,139.77541,,,,,,,,,,,03-5211-4345,,24����,�Ȃ�,183��,������p�̂�,,�L��,���֏�,���]�Ԓ��ԏ�,�񋟂��钓�֏�̏�񂪐��m�Ȃ��̂ƂȂ�悤�ɓw�߂Ă���܂����A���p�҂����̒��֏�̏���p���čs���s�ׂɂ��āA�ӔC�͕����܂���̂ŁA���炩���߂��������������B,�����s�E���c��,
1002,���c��,�ѓc���w������P���]�Ԓ��ԏ�,�����s���c��ѓc��3-12��,35.702128,139.745445,,,,,,,,,,,03-5211-4345,,24����,�Ȃ�,80��,������p�̂�,,�L��,���֏�,���]�Ԓ��ԏ�,�񋟂��钓�֏�̏�񂪐��m�Ȃ��̂ƂȂ�悤�ɓw�߂Ă���܂����A���p�҂����̒��֏�̏���p���čs���s�ׂɂ��āA�ӔC�͕����܂���̂ŁA���炩���߂��������������B,�����s�E���c��,
1003,���c��,�ѓc���w������Q���]�Ԓ��ԏ�,�����s���c��ѓc��3-11-30��,35.702592,139.745882,,,,,,,,,,,03-5211-4345,,24����,�Ȃ�,100��,������p�̂�,,�L��,���֏�,���]�Ԓ��ԏ�,�񋟂��钓�֏�̏�񂪐��m�Ȃ��̂ƂȂ�悤�ɓw�߂Ă���܂����A���p�҂����̒��֏�̏���p���čs���s�ׂɂ��āA�ӔC�͕����܂���̂ŁA���炩���߂��������������B,�����s�E���c��,
1004,���c��,�H�t���w������Q���]�Ԓ��ԏ�,�����s���c��_�c�a��1��,35.699331,139.77551,,,,,,,,,,,03-5211-4345,,24����,�Ȃ�,130��,������p�̂�,,�L��,���֏�,���]�Ԓ��ԏ�,�񋟂��钓�֏�̏�񂪐��m�Ȃ��̂ƂȂ�悤�ɓw�߂Ă���܂����A���p�҂����̒��֏�̏���p���čs���s�ׂɂ��āA�ӔC�͕����܂���̂ŁA���炩���߂��������������B,�����s�E���c��,
1005,���c��,�������w���]�Ԓ��ԏ�,�����s���c��_�c�O�蒬2-20��,35.702008,139.754028,,,,,,,,,,,03-5211-4345,,24����,�Ȃ�,65��,������p�̂�,,�L��,���֏�,���]�Ԓ��ԏ�,�񋟂��钓�֏�̏�񂪐��m�Ȃ��̂ƂȂ�悤�ɓw�߂Ă���܂����A���p�҂����̒��֏�̏���p���čs���s�ׂɂ��āA�ӔC�͕����܂���̂ŁA���炩���߂��������������B,�����s�E���c��,
1006,���c��,�_�c�w��P���]�Ԓ��ԏ�,�����s���c��b�蒬2-13��,35.690823,139.770564,,,,,,,,,,,03-5211-4345,,24����,�Ȃ�,114��,������p�̂�,,�L��,���֏�,���]�Ԓ��ԏ�,�񋟂��钓�֏�̏�񂪐��m�Ȃ��̂ƂȂ�悤�ɓw�߂Ă���܂����A���p�҂����̒��֏�̏���p���čs���s�ׂɂ��āA�ӔC�͕����܂���̂ŁA���炩���߂��������������B,�����s�E���c��,
1007,���c��,�_�c�w��Q���]�Ԓ��ԏ�,�����s���c��b�蒬2-11��,35.69321,139.771666,,,,,,,,,,,03-5211-4345,,24����,�Ȃ�,100��,������p�̂�,,�L��,���֏�,���]�Ԓ��ԏ�,�񋟂��钓�֏�̏�񂪐��m�Ȃ��̂ƂȂ�悤�ɓw�߂Ă���܂����A���p�҂����̒��֏�̏���p���čs���s�ׂɂ��āA�ӔC�͕����܂���̂ŁA���炩���߂��������������B,�����s�E���c��,
1008,���c��,�s���J�w���]�Ԓ��ԏ�,�����s���c���i�k4-4��,35.691637,139.736727,,,,,,,,,,,03-5211-4345,,24����,�Ȃ�,85��,������p�̂�,,�L��,���֏�,���]�Ԓ��ԏ�,�񋟂��钓�֏�̏�񂪐��m�Ȃ��̂ƂȂ�悤�ɓw�߂Ă���܂����A���p�҂����̒��֏�̏���p���čs���s�ׂɂ��āA�ӔC�͕����܂���̂ŁA���炩���߂��������������B,�����s�E���c��,
1009,���c��,�ѓc���w��R���]�Ԓ��ԏ�,�����s���c��ѓc��4-10��,35.702189,139.744256,,,,,,,,,,,03-5211-4345,,24����,�Ȃ�,90��,������p�̂�,,�L��,���֏�,���]�Ԓ��ԏ�,�񋟂��钓�֏�̏�񂪐��m�Ȃ��̂ƂȂ�悤�ɓw�߂Ă���܂����A���p�҂����̒��֏�̏���p���čs���s�ׂɂ��āA�ӔC�͕����܂���̂ŁA���炩���߂��������������B,�����s�E���c��,
1010,���c��,��{���w�Վ����]�Ԓ��ԏ�,�����s���c��_�c��{��15,35.696654,139.77526,,,,,,,,,,,03-5211-4345,,24����,�Ȃ�,38��,������p�̂�,,�L��,���֏�,���]�Ԓ��ԏ�,�񋟂��钓�֏�̏�񂪐��m�Ȃ��̂ƂȂ�悤�ɓw�߂Ă���܂����A���p�҂����̒��֏�̏���p���čs���s�ׂɂ��āA�ӔC�͕����܂���̂ŁA���炩���߂��������������B,�����s�E���c��,
1011,���c��,�䒃�m���w���]�Ԓ��ԏ�,�����s���c��_�c�x�͑�4-3��,35.698702,139.765556,,,,,,,,,,,03-5211-4345,,24����,�Ȃ�,80��,������p�̂�,,�L��,���֏�,���]�Ԓ��ԏ�,�񋟂��钓�֏�̏�񂪐��m�Ȃ��̂ƂȂ�悤�ɓw�߂Ă���܂����A���p�҂����̒��֏�̏���p���čs���s�ׂɂ��āA�ӔC�͕����܂���̂ŁA���炩���߂��������������B,�����s�E���c��,
1012,���c��,�l�c�J�w���]�Ԓ��ԏ�,�����s���c��Z�Ԓ�14��,35.686204,139.730727,,,,,,,,,,,03-5211-4345,,24����,�Ȃ�,160��,������p�̂�,,�L��,���֏�,���]�Ԓ��ԏ�,�񋟂��钓�֏�̏�񂪐��m�Ȃ��̂ƂȂ�悤�ɓw�߂Ă���܂����A���p�҂����̒��֏�̏���p���čs���s�ׂɂ��āA�ӔC�͕����܂���̂ŁA���炩���߂��������������B,�����s�E���c��,
1013,���c��,��i���w��P���]�Ԓ��ԏ�,�����s���c���i�k1-2�y��3��,35.695674,139.751705,,,,,,,,,,,03-5211-4345,,24����,�Ȃ�,35��,������p�̂�,,�L��,���֏�,���]�Ԓ��ԏ�,�񋟂��钓�֏�̏�񂪐��m�Ȃ��̂ƂȂ�悤�ɓw�߂Ă���܂����A���p�҂����̒��֏�̏���p���čs���s�ׂɂ��āA�ӔC�͕����܂���̂ŁA���炩���߂��������������B,�����s�E���c��,
1014,���c��,��i���w��Q���]�Ԓ��ԏ�,�����s���c��_�c�_�ے�3-7��,35.695371,139.753017,,,,,,,,,,,03-5211-4345,,24����,�Ȃ�,60��,������p�̂�,,�L��,���֏�,���]�Ԓ��ԏ�,�񋟂��钓�֏�̏�񂪐��m�Ȃ��̂ƂȂ�悤�ɓw�߂Ă���܂����A���p�҂����̒��֏�̏���p���čs���s�ׂɂ��āA�ӔC�͕����܂���̂ŁA���炩���߂��������������B,�����s�E���c��,
1015,���c��,�L�y���w��ꍂ�ˉ����]�Ԓ��ԏ�,�����s���c��L�y��2-1�y��2-4��,35.673548,139.761415,,,,,,,,,,,03-5211-4345,,24����,�Ȃ�,50��,������p�̂�,,�L��,���֏�,���]�Ԓ��ԏ�,�񋟂��钓�֏�̏�񂪐��m�Ȃ��̂ƂȂ�悤�ɓw�߂Ă���܂����A���p�҂����̒��֏�̏���p���čs���s�ׂɂ��āA�ӔC�͕����܂���̂ŁA���炩���߂��������������B,�����s�E���c��,
1016,���c��,�H�t���w�����w�O�L�ꎩ�]�Ԓ��ԏ�,�����s���c��_�c�ԉ���1��,35.698893,139.773581,,,,,,,,,,,03-5211-4345,,24����,�Ȃ�,126��,�ꎞ���p�̂�,��莞�Ԗ����A���̌�L��,,���֏�,���]�Ԓ��ԏ�,�񋟂��钓�֏�̏�񂪐��m�Ȃ��̂ƂȂ�悤�ɓw�߂Ă���܂����A���p�҂����̒��֏�̏���p���čs���s�ׂɂ��āA�ӔC�͕����܂���̂ŁA���炩���߂��������������B,�����s�E���c��,
1017,���c��,�H�t���w�������ˉ����]�Ԓ��ԏ�,�����s���c��_�c������1��,35.699377,139.77298,,,,,,,,,,,03-5211-4345,,24����,�Ȃ�,69��,�ꎞ���p�̂�,��莞�Ԗ����A���̌�L��,,���֏�,���]�Ԓ��ԏ�,�񋟂��钓�֏�̏�񂪐��m�Ȃ��̂ƂȂ�悤�ɓw�߂Ă���܂����A���p�҂����̒��֏�̏���p���čs���s�ׂɂ��āA�ӔC�͕����܂���̂ŁA���炩���߂��������������B,�����s�E���c��,
1018,���c��,�H�t���w���������ˉ����]�Ԓ��ԏ�,�����s���c��_�c�ԉ���1��,35.698347,139.774058,,,,,,,,,,,03-5211-4345,,24����,�Ȃ�,120��,�ꎞ���p�̂�,��莞�Ԗ����A���̌�L��,,���֏�,���]�Ԓ��ԏ�,�񋟂��钓�֏�̏�񂪐��m�Ȃ��̂ƂȂ�悤�ɓw�߂Ă���܂����A���p�҂����̒��֏�̏���p���čs���s�ׂɂ��āA�ӔC�͕����܂���̂ŁA���炩���߂��������������B,�����s�E���c��,
1019,���c��,�������w�������]�Ԓ��ԏ�,�����s���c��_�c�O�蒬2-20��,35.702115,139.753706,,,,,,,,,,,03-5211-4345,,24����,�Ȃ�,62��,�ꎞ���p�̂�,��莞�Ԗ����A���̌�L��,,���֏�,���]�Ԓ��ԏ�,�񋟂��钓�֏�̏�񂪐��m�Ȃ��̂ƂȂ�悤�ɓw�߂Ă���܂����A���p�҂����̒��֏�̏���p���čs���s�ׂɂ��āA�ӔC�͕����܂���̂ŁA���炩���߂��������������B,�����s�E���c��,
1020,���c��,�b�苴���ˉ����]�Ԓ��ԏ�,�����s���c��ۂ̓�1-10��y�ъۂ̓�3-7��,35.677697,139.765446,,,,,,,,,,,03-5211-4345,,24����,�Ȃ�,134��,�ꎞ���p�̂�,��莞�Ԗ����A���̌�L��,,���֏�,���]�Ԓ��ԏ�,�񋟂��钓�֏�̏�񂪐��m�Ȃ��̂ƂȂ�悤�ɓw�߂Ă���܂����A���p�҂����̒��֏�̏���p���čs���s�ׂɂ��āA�ӔC�͕����܂���̂ŁA���炩���߂��������������B,�����s�E���c��,
1021,���c��,��蒬���]�Ԓ��ԏ�,�����s���c���蒬2-2��y��5��,35.6846162,139.767664,,,,,,,,,,,03-5211-4345,,24����,�Ȃ�,244��,�ꎞ���p�̂�,��莞�Ԗ����A���̌�L��,,���֏�,���]�Ԓ��ԏ�,�񋟂��钓�֏�̏�񂪐��m�Ȃ��̂ƂȂ�悤�ɓw�߂Ă���܂����A���p�҂����̒��֏�̏���p���čs���s�ׂɂ��āA�ӔC�͕����܂���̂ŁA���炩���߂��������������B,�����s�E���c��,
1022,���c��,�a�򋴏o���������]�Ԓ��ԏ�,�����s�_�c���v�Ԓ�1-11��,35.6974238,139.775061,,,,,,,,,,,03-5211-4345,,24����,�Ȃ�,23��,�ꎞ���p�̂�,��莞�Ԗ����A���̌�L��,,���֏�,���]�Ԓ��ԏ�,�񋟂��钓�֏�̏�񂪐��m�Ȃ��̂ƂȂ�悤�ɓw�߂Ă���܂����A���p�҂����̒��֏�̏���p���čs���s�ׂɂ��āA�ӔC�͕����܂���̂ŁA���炩���߂��������������B,�����s�E���c��,
1023,���c��,�H�t���������]�Ԓ��ԏ�,�����s�_�c���v�Ԓ�1-18,35.6979873,139.775023,,,,,,,,,,,03-5211-4345,,24����,�Ȃ�,44��,�ꎞ���p�̂�,��莞�Ԗ����A���̌�L��,,���֏�,���]�Ԓ��ԏ�,�񋟂��钓�֏�̏�񂪐��m�Ȃ��̂ƂȂ�悤�ɓw�߂Ă���܂����A���p�҂����̒��֏�̏���p���čs���s�ׂɂ��āA�ӔC�͕����܂���̂ŁA���炩���߂��������������B,�����s�E���c��,
1024,���c��,�H�t���w������P���]�Ԓ��ԏ�,�����s���c��_�c���͒�4��,35.6982018,139.775493,,,,,,,,,,,03-5211-4345,,24����,�Ȃ�,30��,�ꎞ���p�̂�,��莞�Ԗ����A���̌�L��,,���֏�,���]�Ԓ��ԏ�,�񋟂��钓�֏�̏�񂪐��m�Ȃ��̂ƂȂ�悤�ɓw�߂Ă���܂����A���p�҂����̒��֏�̏���p���čs���s�ׂɂ��āA�ӔC�͕����܂���̂ŁA���炩���߂��������������B,�����s�E���c��,
1025,���c��,�_�ے������_���]�Ԓ��ԏ�,�����s���c��_�c�_�ے�2-3-10,35.6956925,139.757441,,,,,,,,,,,03-5211-4345,,24����,�Ȃ�,64��,�ꎞ���p�̂�,��莞�Ԗ����A���̌�L��,,���֏�,���]�Ԓ��ԏ�,�񋟂��钓�֏�̏�񂪐��m�Ȃ��̂ƂȂ�悤�ɓw�߂Ă���܂����A���p�҂����̒��֏�̏���p���čs���s�ׂɂ��āA�ӔC�͕����܂���̂ŁA���炩���߂��������������B,�����s�E���c��,
1026,���c��,��蒬���ˉ����]�Ԓ��ԏ�,�����s���c���蒬2-5-25��,35.6847342,139.768396,,,,,,,,,,,03-5211-4345,,24����,�Ȃ�,70��,�ꎞ���p�̂�,��莞�Ԗ����A���̌�L��,,���֏�,���]�Ԓ��ԏ�,�񋟂��钓�֏�̏�񂪐��m�Ȃ��̂ƂȂ�悤�ɓw�߂Ă���܂����A���p�҂����̒��֏�̏���p���čs���s�ׂɂ��āA�ӔC�͕����܂���̂ŁA���炩���߂��������������B,�����s�E���c��,
1027,���c��,��蒬�]�˒ʂ莩�]�Ԓ��ԏ�,�����s���c���蒬2-5��,35.685339,139.7686,,,,,,,,,,,03-5211-4345,,24����,�Ȃ�,86��,������p�̂�,,�L��,���֏�,���]�Ԓ��ԏ�,�񋟂��钓�֏�̏�񂪐��m�Ȃ��̂ƂȂ�悤�ɓw�߂Ă���܂����A���p�҂����̒��֏�̏���p���čs���s�ׂɂ��āA�ӔC�͕����܂���̂ŁA���炩���߂��������������B,�����s�E���c��,
1029,���c��,�H�t���w���������������]�Ԓ��ԏ�,�����s���c��O�_�c4-14-1��,35.699715,139.773078,,,,,,,,,,,03-5211-4345,,24����,�Ȃ�,35��,�ꎞ���p�̂�,��莞�Ԗ����A���̌�L��,,���֏�,���]�Ԓ��ԏ�,�񋟂��钓�֏�̏�񂪐��m�Ȃ��̂ƂȂ�悤�ɓw�߂Ă���܂����A���p�҂����̒��֏�̏���p���čs���s�ׂɂ��āA�ӔC�͕����܂���̂ŁA���炩���߂��������������B,�����s�E���c��,
1040,���c��,�ۃm���b�苴���֏�,�����s���c��ۂ̓�3-8-2,35.677006,139.766527,,,,,,,,,,,0120-3566-21,24���Ԏ�t�R�[���Z���^�[,24����,�Ȃ�,60��,�ꎞ���p�̂�,�L��,,���֏�,���]�Ԓ��ԏ�,�񋟂��钓�֏�̏�񂪐��m�Ȃ��̂ƂȂ�悤�ɓw�߂Ă���܂����A���p�҂����̒��֏�̏���p���čs���s�ׂɂ��āA�ӔC�͕����܂���̂ŁA���炩���߂��������������B,���v���c�@�l�����s���H�����ۑS����,
1041,���c��,�_�c�w�����]�Ԓ��ԏ�,�����s���c��b�蒬2-7,35.6928953,139.771783,,,,,,,,,,,03-5211-4345,,24����,�Ȃ�,11��,�ꎞ���p�̂�,��莞�Ԗ����A���̌�L��,,���֏�,���]�Ԓ��ԏ�,�񋟂��钓�֏�̏�񂪐��m�Ȃ��̂ƂȂ�悤�ɓw�߂Ă���܂����A���p�҂����̒��֏�̏���p���čs���s�ׂɂ��āA�ӔC�͕����܂���̂ŁA���炩���߂��������������B,�����s�E���c��,
1042,���c��,�L�y���w���]�Ԓ��ԏ�,�����s���c��ۂ̓�3-6��,35.67573,139.76384,,,,,,,,,,,03-5211-4345,,24����,�Ȃ�,33��,�ꎞ���p�̂�,��莞�Ԗ����A���̌�L��,,���֏�,���]�Ԓ��ԏ�,�񋟂��钓�֏�̏�񂪐��m�Ȃ��̂ƂȂ�悤�ɓw�߂Ă���܂����A���p�҂����̒��֏�̏���p���čs���s�ׂɂ��āA�ӔC�͕����܂���̂ŁA���炩���߂��������������B,�����s�E���c��,
1043,���c��,�_�c�ԉ������]�Ԓ��ԏ�,�����s���c��_�c�ԉ����P��,35.69915,139.77438,,,,,,,,,,,03-5211-4345,,24����,�Ȃ�,22��,�ꎞ���p�̂�,��莞�Ԗ����A���̌�L��,,���֏�,���]�Ԓ��ԏ�,�񋟂��钓�֏�̏�񂪐��m�Ȃ��̂ƂȂ�悤�ɓw�߂Ă���܂����A���p�҂����̒��֏�̏���p���čs���s�ׂɂ��āA�ӔC�͕����܂���̂ŁA���炩���߂��������������B,�����s�E���c��,
1044,���c��,�_�c�w�k���]�Ԓ��ԏ�,�����s���c����_�c3-21��,35.69281,139.77047,,,,,,,,,,,03-5211-4345,,24����,�Ȃ�,13��,�ꎞ���p�̂�,��莞�Ԗ����A���̌�L��,,���֏�,���]�Ԓ��ԏ�,2024�N�R���J�ݗ\��B�񋟂��钓�֏�̏�񂪐��m�Ȃ��̂ƂȂ�悤�ɓw�߂Ă���܂����A���p�҂����̒��֏�̏���p���čs���s�ׂɂ��āA�ӔC�͕����܂���̂ŁA���炩���߂��������������B,�����s�E���c��,
2001,������,����Z���ڒn�����֏�,�����s��������6-10-1��,35.6696126,139.764907,,,,,,,,,,,03-6274-6125,��t�\���ԁF10:00-21:00�i���x�j,24����,�Ȃ�,400��,�ꎞ���p�ƒ�����p�̕���,��莞�Ԗ����A���̌�L��,�L��,���֏�,���]�Ԓ��ԏ�,�񋟂��钓�֏�̏�񂪐��m�Ȃ��̂ƂȂ�悤�ɓw�߂Ă���܂����A���p�҂����̒��֏�̏���p���čs���s�ׂɂ��āA�ӔC�͕����܂���̂ŁA���炩���߂��������������B,�����s�E������,
2002,������,���D�����֏�,�����s�����斾�Β�1-34,35.669489,139.775469,,,,,,,,,,,03-3541-3586,��t�\���ԁF7:00-22:00�i���x�j,24����,�Ȃ�,184��,�ꎞ���p�ƒ�����p�̕���,��莞�Ԗ����A���̌�L��,�L��,���֏�,���]�Ԓ��ԏ�,�񋟂��钓�֏�̏�񂪐��m�Ȃ��̂ƂȂ�悤�ɓw�߂Ă���܂����A���p�҂����̒��֏�̏���p���čs���s�ׂɂ��āA�ӔC�͕����܂���̂ŁA���炩���߂��������������B,�����s�E������,
2003,������,�z�n�s��w�n�����֏�,�����s������z�n5-1-1��,35.6648337,139.766942,,,,,,,,,,,03-3541-3586,��t�\���ԁF7:00-22:00�i���x�j,5:00-��1:00,�Ȃ�,516��,�ꎞ���p�ƒ�����p�̕���,��莞�Ԗ����A���̌�L��,�L��,���֏�,���]�Ԓ��ԏ�,�񋟂��钓�֏�̏�񂪐��m�Ȃ��̂ƂȂ�悤�ɓw�߂Ă���܂����A���p�҂����̒��֏�̏���p���čs���s�ׂɂ��āA�ӔC�͕����܂���̂ŁA���炩���߂��������������B,�����s�E������,
2004,������,���O����꒓�֏�,�����s������z�n7-1-15,35.6666804,139.773402,,,,,,,,,,,03-3541-3586,��t�\���ԁF7:00-22:00�i���x�j,24����,�Ȃ�,62��,������p�̂�,,�L��,���֏�,���]�Ԓ��ԏ�,�񋟂��钓�֏�̏�񂪐��m�Ȃ��̂ƂȂ�悤�ɓw�߂Ă���܂����A���p�҂����̒��֏�̏���p���čs���s�ׂɂ��āA�ӔC�͕����܂���̂ŁA���炩���߂��������������B,�����s�E������,
2005,������,���O����񒓗֏�,�����s������z�n7-5-14,35.6664367,139.773153,,,,,,,,,,,03-3541-3586,��t�\���ԁF7:00-22:00�i���x�j,24����,�Ȃ�,84��,������p�̂�,,�L��,���֏�,���]�Ԓ��ԏ�,�񋟂��钓�֏�̏�񂪐��m�Ȃ��̂ƂȂ�悤�ɓw�߂Ă���܂����A���p�҂����̒��֏�̏���p���čs���s�ׂɂ��āA�ӔC�͕����܂���̂ŁA���炩���߂��������������B,�����s�E������,
2006,������,���O����O���֏�,�����s������z�n7-5-16,35.66632,139.7734,,,,,,,,,,,03-3541-3586,��t�\���ԁF7:00-22:00�i���x�j,24����,�Ȃ�,80��,�ꎞ���p�ƒ�����p�̕���,��莞�Ԗ����A���̌�L��,�L��,���֏�,���]�Ԓ��ԏ�,�񋟂��钓�֏�̏�񂪐��m�Ȃ��̂ƂȂ�悤�ɓw�߂Ă���܂����A���p�҂����̒��֏�̏���p���čs���s�ׂɂ��āA�ӔC�͕����܂���̂ŁA���炩���߂��������������B,�����s�E������,
2007,������,�����x��꒓�֏�,�����s�����攪���x4-5-14,35.6739741,139.77634,,,,,,,,,,,03-3541-3586,��t�\���ԁF7:00-22:00�i���x�j,24����,�Ȃ�,160��,�ꎞ���p�ƒ�����p�̕���,��莞�Ԗ����A���̌�L��,�L��,���֏�,���]�Ԓ��ԏ�,�񋟂��钓�֏�̏�񂪐��m�Ȃ��̂ƂȂ�悤�ɓw�߂Ă���܂����A���p�҂����̒��֏�̏���p���čs���s�ׂɂ��āA�ӔC�͕����܂���̂ŁA���炩���߂��������������B,�����s�E������,
2008,������,�����x��񒓗֏�,�����s�����攪���x4-11-24,35.6739415,139.776855,,,,,,,,,,,03-3541-3586,��t�\���ԁF7:00-22:00�i���x�j,24����,�Ȃ�,101��,������p�̂�,,�L��,���֏�,���]�Ԓ��ԏ�,�񋟂��钓�֏�̏�񂪐��m�Ȃ��̂ƂȂ�悤�ɓw�߂Ă���܂����A���p�҂����̒��֏�̏���p���čs���s�ׂɂ��āA�ӔC�͕����܂���̂ŁA���炩���߂��������������B,�����s�E������,
2009,������,�l�`���꒚�ڒ��֏�,�����s��������{���l�`��1-12-11��,35.68379,139.783705,,,,,,,,,,,03-3662-9913,��t�\���ԁF7:00-22:00�i���x�j,24����,�Ȃ�,125��,�ꎞ���p�ƒ�����p�̕���,��莞�Ԗ����A���̌�L��,�L��,���֏�,���]�Ԓ��ԏ�,�񋟂��钓�֏�̏�񂪐��m�Ȃ��̂ƂȂ�悤�ɓw�߂Ă���܂����A���p�҂����̒��֏�̏���p���čs���s�ׂɂ��āA�ӔC�͕����܂���̂ŁA���炩���߂��������������B,�����s�E������,
2010,������,�l�`���ʂ蒓�֏�,�����s��������{���l�`��1-14-8��A1-16-8��A1-17-8��A1-18-8��A2-1-3��A2-3-1��A2-4-1��A2-6-3��,35.68412,139.78415,35.68429,139.78422,,,,,,,,,03-3662-9913,��t�\���ԁF7:00-22:00�i���x�j,24����,�Ȃ�,137��,������p�̂�,,�L��,���֏�,���]�Ԓ��ԏ�,�񋟂��钓�֏�̏�񂪐��m�Ȃ��̂ƂȂ�悤�ɓw�߂Ă���܂����A���p�҂����̒��֏�̏���p���čs���s�ׂɂ��āA�ӔC�͕����܂���̂ŁA���炩���߂��������������B,�����s�E������,
2011,������,�l�`���񒚖ڒn�����֏�,�����s��������{���l�`��2-12-1,35.6847108,139.784573,,,,,,,,,,,03-5695-3160,��t�\���ԁF7:00-22:00�i�N���N�n�E�j�������������j,24����,�Ȃ�,204��,������p�̂�,,�L��,���֏�,���]�Ԓ��ԏ�,�񋟂��钓�֏�̏�񂪐��m�Ȃ��̂ƂȂ�悤�ɓw�߂Ă���܂����A���p�҂����̒��֏�̏���p���čs���s�ׂɂ��āA�ӔC�͕����܂���̂ŁA���炩���߂��������������B,�����s�E������,
2012,������,�l�`���O���ڒ��֏�,�����s��������{���l�`��3-8-1��,35.68656,139.78251,,,,,,,,,,,03-3662-9913,��t�\���ԁF7:00-22:00�i���x�j,24����,�Ȃ�,52��,������p�̂�,,�L��,���֏�,���]�Ԓ��ԏ�,�񋟂��钓�֏�̏�񂪐��m�Ȃ��̂ƂȂ�悤�ɓw�߂Ă���܂����A���p�҂����̒��֏�̏���p���čs���s�ׂɂ��āA�ӔC�͕����܂���̂ŁA���炩���߂��������������B,�����s�E������,
2013,������,�a�k�����֏�,�����s��������{���a�k��2-1-1��,35.682,139.78683,,,,,,,,,,,03-3662-9913,��t�\���ԁF7:00-22:00�i���x�j,24����,�Ȃ�,126��,�ꎞ���p�ƒ�����p�̕���,��莞�Ԗ����A���̌�L��,�L��,���֏�,���]�Ԓ��ԏ�,�񋟂��钓�֏�̏�񂪐��m�Ȃ��̂ƂȂ�悤�ɓw�߂Ă���܂����A���p�҂����̒��֏�̏���p���čs���s�ׂɂ��āA�ӔC�͕����܂���̂ŁA���炩���߂��������������B,�����s�E������,
2014,������,���蒬���֏�,�����s��������{�����蒬24-2,35.6804244,139.786501,,,,,,,,,,,03-3662-9913,��t�\���ԁF7:00-22:00�i���x�j,24����,�Ȃ�,80��,������p�̂�,,�L��,���֏�,���]�Ԓ��ԏ�,�񋟂��钓�֏�̏�񂪐��m�Ȃ��̂ƂȂ�悤�ɓw�߂Ă���܂����A���p�҂����̒��֏�̏���p���čs���s�ׂɂ��āA�ӔC�͕����܂���̂ŁA���炩���߂��������������B,�����s�E������,
2015,������,�����ʂ蒓�֏�,�����s��������{�����R��9-7��A�����s�����擌���{��2-1-3��A2-1-5��A2-2-5��A2-15-5��A2-15-6��A3-7-16��A3-11-9��,35.6939856,139.785025,35.6916899,139.784978,,,,,,,,,03-3662-9913,��t�\���ԁF7:00-22:00�i���x�j,24����,�Ȃ�,159��,�ꎞ���p�ƒ�����p�̕���,��莞�Ԗ����A���̌�L��,�L��,���֏�,���]�Ԓ��ԏ�,�񋟂��钓�֏�̏�񂪐��m�Ȃ��̂ƂȂ�悤�ɓw�߂Ă���܂����A���p�҂����̒��֏�̏���p���čs���s�ׂɂ��āA�ӔC�͕����܂���̂ŁA���炩���߂��������������B,�����s�E������,
2016,������,�l�������n�����֏�,�����s��������{���l��2-59-4,35.68892,139.78755,,,,,,,,,,,03-3662-9913,��t�\���ԁF7:00-22:00�i���x�j,5:00-��1:00,�Ȃ�,262��,�ꎞ���p�ƒ�����p�̕���,��莞�Ԗ����A���̌�L��,�L��,���֏�,���]�Ԓ��ԏ�,�񋟂��钓�֏�̏�񂪐��m�Ȃ��̂ƂȂ�悤�ɓw�߂Ă���܂����A���p�҂����̒��֏�̏���p���čs���s�ׂɂ��āA�ӔC�͕����܂���̂ŁA���炩���߂��������������B,�����s�E������,
2017,������,���{���񒚖ڒn�����֏�,�����s��������{��2-10-8��,35.6808839,139.774714,,,,,,,,,,,03-3662-9913,��t�\���ԁF7:00-22:00�i���x�j,5:00-��1:00,�Ȃ�,134��,�ꎞ���p�ƒ�����p�̕���,��莞�Ԗ����A���̌�L��,�L��,���֏�,���]�Ԓ��ԏ�,�񋟂��钓�֏�̏�񂪐��m�Ȃ��̂ƂȂ�悤�ɓw�߂Ă���܂����A���p�҂����̒��֏�̏���p���čs���s�ׂɂ��āA�ӔC�͕����܂���̂ŁA���炩���߂��������������B,�����s�E������,
2018,������,���꒬���֏�,�����s��������{�����꒬2-17-13,35.6790282,139.781096,,,,,,,,,,,03-3662-9913,��t�\���ԁF7:00-22:00�i���x�j,24����,�Ȃ�,100��,�ꎞ���p�ƒ�����p�̕���,��莞�Ԗ����A���̌�L��,�L��,���֏�,���]�Ԓ��ԏ�,�񋟂��钓�֏�̏�񂪐��m�Ȃ��̂ƂȂ�悤�ɓw�߂Ă���܂����A���p�҂����̒��֏�̏���p���čs���s�ׂɂ��āA�ӔC�͕����܂���̂ŁA���炩���߂��������������B,�����s�E������,
2019,������,�����w�O��꒓�֏�,�����s�����挎��2-1-1��,35.66391,139.78539,,,,,,,,,,,03-3533-2935,��t�\���ԁF7:00-22:00�i���x�j,24����,�Ȃ�,500��,�ꎞ���p�ƒ�����p�̕���,��莞�Ԗ����A���̌�L��,�L��,���֏�,���]�Ԓ��ԏ�,�񋟂��钓�֏�̏�񂪐��m�Ȃ��̂ƂȂ�悤�ɓw�߂Ă���܂����A���p�҂����̒��֏�̏���p���čs���s�ׂɂ��āA�ӔC�͕����܂���̂ŁA���炩���߂��������������B,�����s�E������,
2020,������,�����w�n�����֏�,�����s�����挎��2-10-3��,35.6633856,139.783684,,,,,,,,,,,03-3533-2935,��t�\���ԁF7:00-22:00�i���x�j,5:00-��1:00,�Ȃ�,777��,�ꎞ���p�ƒ�����p�̕���,��莞�Ԗ����A���̌�L��,�L��,���֏�,���]�Ԓ��ԏ�,�񋟂��钓�֏�̏�񂪐��m�Ȃ��̂ƂȂ�悤�ɓw�߂Ă���܂����A���p�҂����̒��֏�̏���p���čs���s�ׂɂ��āA�ӔC�͕����܂���̂ŁA���炩���߂��������������B,�����s�E������,
2021,������,���ǂ��w�n�����֏�,�����s�����揟�ǂ�1-9-4��,35.65901,139.77716,,,,,,,,,,,03-3533-8036,��t�\���ԁF7:00-22:00�i���x�j,5:00-��1:00,�Ȃ�,855��,�ꎞ���p�ƒ�����p�̕���,��莞�Ԗ����A���̌�L��,�L��,���֏�,���]�Ԓ��ԏ�,�񋟂��钓�֏�̏�񂪐��m�Ȃ��̂ƂȂ�悤�ɓw�߂Ă���܂����A���p�҂����̒��֏�̏���p���čs���s�ׂɂ��āA�ӔC�͕����܂���̂ŁA���炩���߂��������������B,�����s�E������,
2022,������,���d�F�񒚖ڒn�����֏�,�����s�����攪�d�F2-1-4,35.67988,139.76984,,,,,,,,,,,03-3527-9153,��t�\���ԁF7:00-22:00�i���x�j,5:00-��1:00,�Ȃ�,290��,�ꎞ���p�̂�,��莞�Ԗ����A���̌�L��,,,,,,
3001,�`��,�c���w�������]�ԓ����ԏ�,�����s�`��ŉY3-3��,35.64417,139.74833,,,,,,,,,,,03-5443-0590,,4:30-(��)1:30,�Ȃ�,1200��,�ꎞ���p�ƒ�����p�̕���,��莞�Ԗ����A���̌�L��,�L��,���֏�,���]�Ԓ��ԏ�,�񋟂��钓�֏�̏�񂪐��m�Ȃ��̂ƂȂ�悤�ɓw�߂Ă���܂����A���p�҂����̒��֏�̏���p���čs���s�ׂɂ��āA�ӔC�͕����܂���̂ŁA���炩���߂��������������B,�����s�E�`��,
3002,�`��,�i��w�`������]�ԓ����ԏ�,�����s�`��`��2-14-6,35.62858,139.7418,35.62927,139.74186,,,,,,,,,03-3472-7931,,4:30-(��)1:30,�Ȃ�,800��,�ꎞ���p�ƒ�����p�̕���,��莞�Ԗ����A���̌�L��,�L��,���֏�,���]�Ԓ��ԏ�,�񋟂��钓�֏�̏�񂪐��m�Ȃ��̂ƂȂ�悤�ɓw�߂Ă���܂����A���p�҂����̒��֏�̏���p���čs���s�ׂɂ��āA�ӔC�͕����܂���̂ŁA���炩���߂��������������B,�����s�E�`��,
3003,�`��,�������։w���]�Ԓ��ԏ�,�����s�`�捂��1-3-20��,35.64345,139.73464,,,,,,,,,,,03-3440-6191,,4:30-(��)1:00,�Ȃ�,270��,�ꎞ���p�ƒ�����p�̕���,��莞�Ԗ����A���̌�L��,�L��,���֏�,���]�Ԓ��ԏ�,�񋟂��钓�֏�̏�񂪐��m�Ȃ��̂ƂȂ�悤�ɓw�߂Ă���܂����A���p�҂����̒��֏�̏���p���čs���s�ׂɂ��āA�ӔC�͕����܂���̂ŁA���炩���߂��������������B,�����s�E�`��,
3004,�`��,�l�����w�k�����]�ԓ����ԏ�,�����s�`��C��1-2-34,35.6565,139.75816,35.65674,139.75822,,,,,,,,,03-3434-3150,,4:30-(��)1:30,�Ȃ�,200��,�ꎞ���p�ƒ�����p�̕���,��莞�Ԗ����A���̌�L��,�L��,���֏�,���]�Ԓ��ԏ�,�񋟂��钓�֏�̏�񂪐��m�Ȃ��̂ƂȂ�悤�ɓw�߂Ă���܂����A���p�҂����̒��֏�̏���p���čs���s�ׂɂ��āA�ӔC�͕����܂���̂ŁA���炩���߂��������������B,�����s�E�`��,
3005,�`��,�����Ȃ񐯂̌������]�Ԓ��ԏ�,�����s�`��`��1-9-24,35.62971,139.7426,,,,,,,,,,,03-6712-9343,,4:30-(��)1:30,�Ȃ�,1020��,������p�̂�,,�L��,���֏�,���]�Ԓ��ԏ�,�񋟂��钓�֏�̏�񂪐��m�Ȃ��̂ƂȂ�悤�ɓw�߂Ă���܂����A���p�҂����̒��֏�̏���p���čs���s�ׂɂ��āA�ӔC�͕����܂���̂ŁA���炩���߂��������������B,�����s�E�`��,
3006,�`��,�O�͑�������]�Ԓ��ԏ�,�����s�`��Z�{��4-2-27,35.66428,139.73368,,,,,,,,,,,03-3408-5135,,4:30-(��)1:30,�Ȃ�,204��,�ꎞ���p�ƒ�����p�̕���,��莞�Ԗ����A���̌�L��,�L��,���֏�,���]�Ԓ��ԏ�,�񋟂��钓�֏�̏�񂪐��m�Ȃ��̂ƂȂ�悤�ɓw�߂Ă���܂����A���p�҂����̒��֏�̏���p���čs���s�ׂɂ��āA�ӔC�͕����܂���̂ŁA���炩���߂��������������B,�����s�E�`��,
3007,�`��,���c�������]�Ԓ��ԏ�,�����s�`��V��3-16-15,35.66503,139.75674,,,,,,,,,,,03-3432-9090,,4:30-(��)1:30,�Ȃ�,408��,�ꎞ���p�ƒ�����p�̕���,��莞�Ԗ����A���̌�L��,�L��,���֏�,���]�Ԓ��ԏ�,�񋟂��钓�֏�̏�񂪐��m�Ȃ��̂ƂȂ�悤�ɓw�߂Ă���܂����A���p�҂����̒��֏�̏���p���čs���s�ׂɂ��āA�ӔC�͕����܂���̂ŁA���炩���߂��������������B,�����s�E�`��,
3008,�`��,���z�\�ԉw���]�ԓ����ԏ�,�����s�`�斃�z�\��1-4-14,35.65673,139.73433,,,,,,,,,,,03-4213-8016,,4:30-(��)1:30,�Ȃ�,84��,�ꎞ���p�ƒ�����p�̕���,��莞�Ԗ����A���̌�L��,�L��,���֏�,���]�Ԓ��ԏ�,�񋟂��钓�֏�̏�񂪐��m�Ȃ��̂ƂȂ�悤�ɓw�߂Ă���܂����A���p�҂����̒��֏�̏���p���čs���s�ׂɂ��āA�ӔC�͕����܂���̂ŁA���炩���߂��������������B,�����s�E�`��,
3009,�`��,�L���w���]�Ԓ��ԏ�,�����s�`��얃�z5-1-25,35.65326,139.72181,35.6531,139.72207,,,,,,,,,03-5420-1171,,4:30-(��)1:30,�Ȃ�,195��,�ꎞ���p�ƒ�����p�̕���,��莞�Ԗ����A���̌�L��,�L��,���֏�,���]�Ԓ��ԏ�,�񋟂��钓�֏�̏�񂪐��m�Ȃ��̂ƂȂ�悤�ɓw�߂Ă���܂����A���p�҂����̒��֏�̏���p���čs���s�ׂɂ��āA�ӔC�͕����܂���̂ŁA���炩���߂��������������B,�����s�E�`��,
3010,�`��,�Z�{�؉w���]�Ԓ��ԏ�,�����s�`��Z�{��6-5-19,35.66175,139.73068,,,,,,,,,,,03-3470-4186,,4:30-(��)1:30,�Ȃ�,428��,������p�̂�,,�L��,���֏�,���]�Ԓ��ԏ�,�񋟂��钓�֏�̏�񂪐��m�Ȃ��̂ƂȂ�悤�ɓw�߂Ă���܂����A���p�҂����̒��֏�̏���p���čs���s�ׂɂ��āA�ӔC�͕����܂���̂ŁA���炩���߂��������������B,�����s�E�`��,
3011,�`��,������w���]�Ԓ��ԏ�,�����s�`�攒����4-6-2,35.63883,139.72683,,,,,,,,,,,03-6450-4347,,4:30-(��)1:30,�Ȃ�,281��,�ꎞ���p�ƒ�����p�̕���,��莞�Ԗ����A���̌�L��,�L��,���֏�,���]�Ԓ��ԏ�,�񋟂��钓�֏�̏�񂪐��m�Ȃ��̂ƂȂ�悤�ɓw�߂Ă���܂����A���p�҂����̒��֏�̏���p���čs���s�ׂɂ��āA�ӔC�͕����܂���̂ŁA���炩���߂��������������B,�����s�E�`��,
3012,�`��,��̋��������]�Ԓ��ԏ�,�����s�`�擌���z3-9-1,35.65603,139.73787,,,,,,,,,,,03-3587-6653,,4:30-(��)1:30,�Ȃ�,400��,�ꎞ���p�ƒ�����p�̕���,��莞�Ԗ����A���̌�L��,�L��,���֏�,���]�Ԓ��ԏ�,�񋟂��钓�֏�̏�񂪐��m�Ȃ��̂ƂȂ�悤�ɓw�߂Ă���܂����A���p�҂����̒��֏�̏���p���čs���s�ׂɂ��āA�ӔC�͕����܂���̂ŁA���炩���߂��������������B,�����s�E�`��,
4007,�V�h��,�����w���]�ԓ����ԏ�,�����s�V�h��В�5��,39.69278,139.72399,,,,,,,,,,,0120-991-674,24���Ԏ�t�R�[���Z���^�[�i�T�C�J�p�[�L���O�j,24����,�Ȃ�,267��,�ꎞ���p�ƒ�����p�̕���,��莞�Ԗ����A���̌�L��,�L��,���֏�,���]�ԓ����ԏ�,�񋟂��钓�֏�̏�񂪐��m�Ȃ��̂ƂȂ�悤�ɓw�߂Ă���܂����A���p�҂����̒��֏�̏���p���čs���s�ׂɂ��āA�ӔC�͕����܂���̂ŁA���炩���߂��������������B,�����s�E�V�h��,
4008,�V�h��,�����w������֒��ԏ�,�����s�V�h��В�5��,39.69255,139.72469,,,,,,,,,,,0120-991-674,24���Ԏ�t�R�[���Z���^�[�i�T�C�J�p�[�L���O�j,24����,�Ȃ�,18��,�ꎞ���p�̂�,��莞�Ԗ����A���̌�L��,�[,���֏�,������֒��ԏ�,�񋟂��钓�֏�̏�񂪐��m�Ȃ��̂ƂȂ�悤�ɓw�߂Ă���܂����A���p�҂����̒��֏�̏���p���čs���s�ׂɂ��āA�ӔC�͕����܂���̂ŁA���炩���߂��������������B,�����s�E�V�h��,
4009,�V�h��,�ѓc���w���]�ԓ����ԏ�,�����s�V�h��_�y�͊�1��,35.7006,139.74295,,,,,,,,,,,0120-991-674,24���Ԏ�t�R�[���Z���^�[�i�T�C�J�p�[�L���O�j,24����,�Ȃ�,171��,������p�̂�,�[,�L��,���֏�,���]�ԓ����ԏ�,�񋟂��钓�֏�̏�񂪐��m�Ȃ��̂ƂȂ�悤�ɓw�߂Ă���܂����A���p�҂����̒��֏�̏���p���čs���s�ׂɂ��āA�ӔC�͕����܂���̂ŁA���炩���߂��������������B,�����s�E�V�h��,
4010,�V�h��,�ѓc���w���֏�,�����s�V�h�扺�{�䒬1��,35.7028,139.74436,,,,,,,,,,,0120-991-674,24���Ԏ�t�R�[���Z���^�[�i�T�C�J�p�[�L���O�j,24����,�Ȃ�,47��,�ꎞ���p�̂�,��莞�Ԗ����A���̌�L��,�[,���֏�,���]�Ԓ��ԏ�,�񋟂��钓�֏�̏�񂪐��m�Ȃ��̂ƂȂ�悤�ɓw�߂Ă���܂����A���p�҂����̒��֏�̏���p���čs���s�ׂɂ��āA�ӔC�͕����܂���̂ŁA���炩���߂��������������B,�����s�E�V�h��,
4011,�V�h��,�s���J�w���֏�,�����s�V�h��s�J�c��1-10�n��A14�n��A�s�J�c��2-5��A7��,35.69445,139.73773,,,,,,,,,,,0120-991-674,24���Ԏ�t�R�[���Z���^�[�i�T�C�J�p�[�L���O�j,24����,�Ȃ�,�W�W��,�ꎞ���p�̂�,��莞�Ԗ����A���̌�L��,�[,���֏�,���]�Ԓ��֏�,�񋟂��钓�֏�̏�񂪐��m�Ȃ��̂ƂȂ�悤�ɓw�߂Ă���܂����A���p�҂����̒��֏�̏���p���čs���s�ׂɂ��āA�ӔC�͕����܂���̂ŁA���炩���߂��������������B,�����s�E�V�h��,
4012,�V�h��,�����_�y��w���֏�`,�����s�V�h��\�y��43�n��,35.70076,139.73586,,,,,,,,,,,0120-991-674,24���Ԏ�t�R�[���Z���^�[�i�T�C�J�p�[�L���O�j,24����,�Ȃ�,20��,�ꎞ���p�̂�,��莞�Ԗ����A���̌�L��,�[,���֏�,���]�Ԓ��֏�,�񋟂��钓�֏�̏�񂪐��m�Ȃ��̂ƂȂ�悤�ɓw�߂Ă���܂����A���p�҂����̒��֏�̏���p���čs���s�ׂɂ��āA�ӔC�͕����܂���̂ŁA���炩���߂��������������B,�����s�E�V�h��,
4013,�V�h��,�����_�y��w���֏�a,�����s�V�h��\�y��15�n��,35.70042,139.73431,,,,,,,,,,,0120-991-674,24���Ԏ�t�R�[���Z���^�[�i�T�C�J�p�[�L���O�j,24����,�Ȃ�,37��,�ꎞ���p�ƒ�����p�̕���,��莞�Ԗ����A���̌�L��,�L��,���֏�,���]�Ԓ��֏�,�񋟂��钓�֏�̏�񂪐��m�Ȃ��̂ƂȂ�悤�ɓw�߂Ă���܂����A���p�҂����̒��֏�̏���p���čs���s�ׂɂ��āA�ӔC�͕����܂���̂ŁA���炩���߂��������������B,�����s�E�V�h��,
4014,�V�h��,���������w���]�ԓ����ԏ�`,�����s�V�h�挴��1-10,35.69959,139.7252,,,,,,,,,,,0120-991-674,24���Ԏ�t�R�[���Z���^�[�i�T�C�J�p�[�L���O�j,24����,�Ȃ�,133��,�ꎞ���p�ƒ�����p�̕���,��莞�Ԗ����A���̌�L��,�L��,���֏�,���]�ԓ����ԏ�,�񋟂��钓�֏�̏�񂪐��m�Ȃ��̂ƂȂ�悤�ɓw�߂Ă���܂����A���p�҂����̒��֏�̏���p���čs���s�ׂɂ��āA�ӔC�͕����܂���̂ŁA���炩���߂��������������B,�����s�E�V�h��,
4015,�V�h��,���������w���]�ԓ����ԏ�a,�����s�V�h�挴��2-6,35.69946,139.72424,,,,,,,,,,,0120-991-674,24���Ԏ�t�R�[���Z���^�[�i�T�C�J�p�[�L���O�j,24����,�Ȃ�,50��,�ꎞ���p�ƒ�����p�̕���,��莞�Ԗ����A���̌�L��,�L��,���֏�,���]�ԓ����ԏ�,�񋟂��钓�֏�̏�񂪐��m�Ȃ��̂ƂȂ�悤�ɓw�߂Ă���܂����A���p�҂����̒��֏�̏���p���čs���s�ׂɂ��āA�ӔC�͕����܂���̂ŁA���炩���߂��������������B,�����s�E�V�h��,